{"text_format":"1","workbook":"xlsx","n_sheets":5,"sheets":["General Information","Statistics","Code","General Statistics","Graph"],"not_rendered":{"charts":2,"images":2,"macros":0,"external_links":1,"defined_names":13,"comments":0,"pivot_tables":0},"unopened":[],"bounds":{"document_bytes":16777216,"sheet_cells":100000,"rows_first":2000,"rows_last":500,"rows_between":2000,"halvings":0,"cell_chars":16384,"cell_head_chars":4096},"cells_cut":0,"cells_raw":0,"read":"whole","date_system":"1900"}

{"sheet":"General Information","index":0,"n_rows":21585,"n_cols":18,"rows_kept":21585,"cut":false,"hidden":false,"merged":[[1,1,1,12],[2,1,2,12],[4,1,4,12],[3,1,3,12]]}
[]
[null,"William V. S. Tubman University"]
[null,"General List of Students Registered"]
[null,"Second Semester 2010/2011 Academic Year"]
[]
[]
[]
[null,"#","ID #","First Name","Middle initial","Last Name","Sex","College","County of Origin","Year","Semester","Status","Contact #","WAEC Certification","Sr. High Diploma","Transcript","Health Certificate","Remmendation Letters"]
[null,1218,"TU-00792","A Bobby","S.","Tuwilay","Male","College of Agriculture and Food Sciences","River Gee","2011/2012","First Semester","Liberian Student",6480898]
[null,1273,"TU-00745","A Domiquel",null,"Gbayon","Male","College of Agriculture and Food Sciences","Grand Gedeh","2011/2012","First Semester","Liberian Student",880423338]
[null,6,"TU-00458","A.Silkerjea",null,"Nugba","Male","College of Technology","Maryland","2010/2011","First Semester","Liberian Student",6447306]
[null,31,"TU-00033","Aaron","N.","Collins","Male","College of Management","River Gee","2009/2010","First Semester","Liberian Student",6732505]
[null,211,"TU-00033","Aaron","N.","Collins","Male","College of Management","River Gee","2009/2010","Second Semester","Liberian Student",6340945]
[null,1,"TU-00033","Aaron","N.","Collins","Male","College of Management","River Gee","2010/2011","First Semester","Liberian Student",6732505]
[null,436,"TU-00033","Aaron","N.","Collins","Male","College of Management","River Gee","2010/2011","Second Semester","Liberian Student",880422755]
[null,1257,"TU-00716","Aaron","J.","Wion","Male","College of Agriculture and Food Sciences","Grand Gedeh","2011/2012","First Semester","Liberian Student",6270994]
[null,null,"TU-00033","Aaron","N.","Collins","Male","College of Management",null,"2011/2012","First Semester","Liberian Student",880422753]
[null,null,"TU-00702","Abe","S.","Moore","Male","College of Education","Maryland","2011/2012","First Semester","Liberian Student",6636164]
[null,47,"TU-00021","Abednego","J.","Harris","Male","College of Agriculture and Food Sciences","Maryland","2010/2011","Second Semester","Liberian Student",6882547]
[null,468,"TU-00027","Abednego","W.","Tealeh","Male","College of Agriculture and Food Sciences","Maryland","2010/2011","Second Semester","Liberian Student",6740099]
{"$rows_left_out":21566}
{"sheet":"Statistics","index":1,"n_rows":36,"n_cols":6,"rows_kept":36,"cut":false,"hidden":false,"merged":[[2,3,2,5],[20,3,20,5],[4,4,4,5],[22,4,22,5],[24,4,24,5],[23,4,23,5],[5,4,5,5],[6,4,6,5]]}
[]
[]
[null,null,null,"Statistics per County"]
[]
[null,null,null,"Name of County","Maryland"]
[null,null,null,"Year","2011/2012"]
[null,null,null,"Semester","First Semester"]
[]
[null,null,null,"College","Male","Female"]
[null,null,null,"College of Health Sciences",{"$f":"COUNTIFS('General Information'!I10:I21492,E5,'General Information'!J10:J21492,E6,'General Information'!K10:K21492,E7,'General Information'!H10:H21492,D10,'General Information'!G10:G21492,E9)","v":19},{"$f":"COUNTIFS('General Information'!I10:I21492,E5,'General Information'!J10:J21492,E6,'General Information'!K10:K21492,E7,'General Information'!H10:H21492,D10,'General Information'!G10:G21492,F9)","v":20}]
[null,null,null,"College of Agriculture and Food Sciences",{"$f":"COUNTIFS('General Information'!I10:I21492,E5,'General Information'!J10:J21492,E6,'General Information'!K10:K21492,E7,'General Information'!H10:H21492,D11,'General Information'!G10:G21492,E9)","v":39},{"$f":"COUNTIFS('General Information'!I10:I21492,E5,'General Information'!J10:J21492,E6,'General Information'!K10:K21492,E7,'General Information'!H10:H21492,D11,'General Information'!G10:G21492,F9)","v":2}]
[null,null,null,"College of Management",{"$f":"COUNTIFS('General Information'!I10:I21492,E5,'General Information'!J10:J21492,E6,'General Information'!K10:K21492,E7,'General Information'!H10:H21492,D12,'General Information'!G10:G21492,E9)","v":36},{"$f":"COUNTIFS('General Information'!I10:I21492,E5,'General Information'!J10:J21492,E6,'General Information'!K10:K21492,E7,'General Information'!H10:H21492,D12,'General Information'!G10:G21492,F9)","v":20}]
[null,null,null,"College of Technology",{"$f":"COUNTIFS('General Information'!I10:I21492,E5,'General Information'!J10:J21492,E6,'General Information'!K10:K21492,E7,'General Information'!H10:H21492,D13,'General Information'!G10:G21492,E9)","v":44},{"$f":"COUNTIFS('General Information'!I10:I21492,E5,'General Information'!J10:J21492,E6,'General Information'!K10:K21492,E7,'General Information'!H10:H21492,D13,'General Information'!G10:G21492,F9)","v":7}]
[null,null,null,"College of Education",{"$f":"COUNTIFS('General Information'!I10:I21492,E5,'General Information'!J10:J21492,E6,'General Information'!K10:K21492,E7,'General Information'!H10:H21492,D14,'General Information'!G10:G21492,E9)","v":45},{"$f":"COUNTIFS('General Information'!I10:I21492,E5,'General Information'!J10:J21492,E6,'General Information'!K10:K21492,E7,'General Information'!H10:H21492,D14,'General Information'!G10:G21492,F9)","v":7}]
[]
[null,null,null,"Total",{"$f":"SUM(E10:E14)","v":183},{"$f":"SUM(F10:F14)","v":56}]
[]
[null,null,null,"Percentage",{"$f":"E16/SUM(E16:F16)","v":0.76569037656903771},{"$f":"F16/SUM(E16:F16)","v":0.23430962343096234}]
[]
[]
{"$rows_left_out":17}
{"sheet":"Code","index":2,"n_rows":20,"n_cols":10,"rows_kept":20,"cut":false,"hidden":true,"merged":[]}
[]
[]
[]
[null,null,"Bomi"]
[null,12,"Bong",null,"Foreign Student",null,null,"Year",null,"Semester"]
[null,7,"Gbarpolu",null,"Liberian Student",null,null,"2009/2010",null,"First Semester"]
[null,11,"Grand Bassa",null,null,null,null,"2010/2011",null,"Second Semester"]
[null,8,"Grand Cape Mount",null,null,null,null,"2011/2012"]
[null,14,"Grand Gedeh",null,null,null,null,"2012/2013"]
[null,5,"Grand Kru",null,null,null,null,"2013/2014"]
[null,4,"Lofa"]
[null,13,"Margibi"]
[null,9,"Maryland"]
[null,1,"Montserrado"]
[null,15,"Nimba"]
[null,6,"Non-Liberian"]
[null,15,"River Cess"]
[null,10,"River Gee"]
[null,3,"Sinoe"]
[null,2,"All Counties"]
{"$rows_left_out":1}
{"sheet":"General Statistics","index":3,"n_rows":45,"n_cols":18,"rows_kept":45,"cut":false,"hidden":false,"merged":[[34,12,34,13],[34,14,34,15],[34,16,34,17],[22,16,22,17],[20,2,20,3],[22,8,22,9],[36,2,36,3],[8,2,8,3],[8,4,8,5],[8,6,8,7],[22,10,22,11],[36,7,36,8],[36,4,37,4],[36,9,37,9],[36,5,37,5],[8,10,8,11],[34,2,34,3],[34,4,34,5],[34,6,34,7],[34,8,34,9],[34,10,34,11],[8,16,8,17],[22,2,22,3],[20,12,20,13],[8,14,8,15],[8,8,8,9],[22,6,22,7],[22,4,22,5],[22,12,22,13],[20,4,20,5],[20,6,20,7],[20,8,20,9],[20,10,20,11],[22,14,22,15],[8,12,8,13],[20,14,20,15],[20,16,20,17],[5,4,5,5],[6,4,6,5],[6,2,6,3],[5,2,5,3],[2,1,2,17],[3,1,3,17],[4,1,4,17]]}
[]
[]
[null,"William V. S. Tubman University"]
[null,"Registration Statistics"]
[]
[null,null,"Year",null,{"$f":"Statistics!E6","v":"2011/2012"}]
[null,null,"Semester",null,{"$f":"Statistics!E7","v":"First Semester"},null,null," "]
[]
[null,null,"Bomi",null,"Bong",null,"Gbarpolu",null,"Grand Bassa",null,"Grand Cape Mount",null,"Grand Gedeh",null,"Grand Kru",null,"Lofa"]
[null,"College","Male","Female","Male","Female","Male","Female","Male","Female","Male","Female","Male","Female","Male","Female","Male","Female"]
[null,"College of Health Sciences",{"$f":"COUNTIFS(Table2[Year],E6,Table2[Semester],E7,Table2[County of Origin],C9,Table2[College],B11,Table2[Sex],C10)","v":0},{"$f":"COUNTIFS(Table2[Year],E6,Table2[Semester],E7,Table2[County of Origin],C9,Table2[College],B11,Table2[Sex],D10)","v":0},{"$f":"COUNTIFS(Table2[Year],E6,Table2[Semester],E7,Table2[County of Origin],E9,Table2[College],B11,Table2[Sex],E10)","v":0},{"$f":"COUNTIFS(Table2[Year],E6,Table2[Semester],E7,Table2[County of Origin],E9,Table2[College],B11,Table2[Sex],F10)","v":1},{"$f":"COUNTIFS(Table2[Year],E6,Table2[Semester],E7,Table2[County of Origin],G9,Table2[College],B11,Table2[Sex],G10)","v":0},{"$f":"COUNTIFS(Table2[Year],E6,Table2[Semester],E7,Table2[County of Origin],G9,Table2[College],B11,Table2[Sex],H10)","v":0},{"$f":"COUNTIFS(Table2[Year],E6,Table2[Semester],E7,Table2[County of Origin],I9,Table2[College],B11,Table2[Sex],I10)","v":3},{"$f":"COUNTIFS(Table2[Year],E6,Table2[Semester],E7,Table2[County of Origin],I9,Table2[College],B11,Table2[Sex],J10)","v":2},{"$f":"COUNTIFS(Table2[Year],E6,Table2[Semester],E7,Table2[County of Origin],K9,Table2[College],B11,Table2[Sex],K10)","v":0},{"$f":"COUNTIFS(Table2[Year],E6,Table2[Semester],E7,Table2[County of Origin],K9,Table2[College],B11,Table2[Sex],L10)","v":1},{"$f":"COUNTIFS(Table2[Year],E6,Table2[Semester],E7,Table2[County of Origin],M9,Table2[College],B11,Table2[Sex],M10)","v":1},{"$f":"COUNTIFS(Table2[Year],E6,Table2[Semester],E7,Table2[County of Origin],M9,Table2[College],B11,Table2[Sex],N10)","v":0},{"$f":"COUNTIFS(Table2[Year],E6,Table2[Semester],E7,Table2[County of Origin],O9,Table2[College],B11,Table2[Sex],O10)","v":4},{"$f":"COUNTIFS(Table2[Year],E6,Table2[Semester],E7,Table2[County of Origin],O9,Table2[College],B11,Table2[Sex],P10)","v":3},{"$f":"COUNTIFS(Table2[Year],E6,Table2[Semester],E7,Table2[County of Origin],Q9,Table2[College],B11,Table2[Sex],Q10)","v":2},{"$f":"COUNTIFS(Table2[Year],E6,Table2[Semester],E7,Table2[County of Origin],Q9,Table2[College],B11,Table2[Sex],R10)","v":2}]
[null,"College of Agriculture and Food Sciences",{"$f":"COUNTIFS(Table2[Year],E6,Table2[Semester],E7,Table2[County of Origin],C9,Table2[College],B12,Table2[Sex],C10)","v":0},{"$f":"COUNTIFS(Table2[Year],E6,Table2[Semester],E7,Table2[County of Origin],C9,Table2[College],B12,Table2[Sex],D10)","v":0},{"$f":"COUNTIFS(Table2[Year],E6,Table2[Semester],E7,Table2[County of Origin],E9,Table2[College],B12,Table2[Sex],E10)","v":0},{"$f":"COUNTIFS(Table2[Year],E6,Table2[Semester],E7,Table2[County of Origin],E9,Table2[College],B12,Table2[Sex],F10)","v":0},{"$f":"COUNTIFS(Table2[Year],E6,Table2[Semester],E7,Table2[County of Origin],G9,Table2[College],B12,Table2[Sex],G10)","v":1},{"$f":"COUNTIFS(Table2[Year],E6,Table2[Semester],E7,Table2[County of Origin],G9,Table2[College],B12,Table2[Sex],H10)","v":0},{"$f":"COUNTIFS(Table2[Year],E6,Table2[Semester],E7,Table2[County of Origin],I9,Table2[College],B12,Table2[Sex],I10)","v":0},{"$f":"COUNTIFS(Table2[Year],E6,Table2[Semester],E7,Table2[County of Origin],I9,Table2[College],B12,Table2[Sex],J10)","v":0},{"$f":"COUNTIFS(Table2[Year],E6,Table2[Semester],E7,Table2[County of Origin],K9,Table2[College],B12,Table2[Sex],K10)","v":0},{"$f":"COUNTIFS(Table2[Year],E6,Table2[Semester],E7,Table2[County of Origin],K9,Table2[College],B12,Table2[Sex],L10)","v":0},{"$f":"COUNTIFS(Table2[Year],E6,Table2[Semester],E7,Table2[County of Origin],M9,Table2[College],B12,Table2[Sex],M10)","v":3},{"$f":"COUNTIFS(Table2[Year],E6,Table2[Semester],E7,Table2[County of Origin],M9,Table2[College],B12,Table2[Sex],N10)","v":0},{"$f":"COUNTIFS(Table2[Year],E6,Table2[Semester],E7,Table2[County of Origin],O9,Table2[College],B12,Table2[Sex],O10)","v":8},{"$f":"COUNTIFS(Table2[Year],E6,Table2[Semester],E7,Table2[County of Origin],O9,Table2[College],B12,Table2[Sex],P10)","v":0},{"$f":"COUNTIFS(Table2[Year],E6,Table2[Semester],E7,Table2[County of Origin],Q9,Table2[College],B12,Table2[Sex],Q10)","v":2},{"$f":"COUNTIFS(Table2[Year],E6,Table2[Semester],E7,Table2[County of Origin],Q9,Table2[College],B12,Table2[Sex],R10)","v":0}]
[null,"College of Management",{"$f":"COUNTIFS(Table2[Year],E6,Table2[Semester],E7,Table2[County of Origin],C9,Table2[College],B13,Table2[Sex],C10)","v":2},{"$f":"COUNTIFS(Table2[Year],E6,Table2[Semester],E7,Table2[County of Origin],C9,Table2[College],B13,Table2[Sex],D10)","v":0},{"$f":"COUNTIFS(Table2[Year],E6,Table2[Semester],E7,Table2[County of Origin],E9,Table2[College],B13,Table2[Sex],E10)","v":0},{"$f":"COUNTIFS(Table2[Year],E6,Table2[Semester],E7,Table2[County of Origin],E9,Table2[College],B13,Table2[Sex],F10)","v":0},{"$f":"COUNTIFS(Table2[Year],E6,Table2[Semester],E7,Table2[County of Origin],G9,Table2[College],B13,Table2[Sex],G10)","v":0},{"$f":"COUNTIFS(Table2[Year],E6,Table2[Semester],E7,Table2[County of Origin],G9,Table2[College],B13,Table2[Sex],H10)","v":0},{"$f":"COUNTIFS(Table2[Year],E6,Table2[Semester],E7,Table2[County of Origin],I9,Table2[College],B13,Table2[Sex],I10)","v":0},{"$f":"COUNTIFS(Table2[Year],E6,Table2[Semester],E7,Table2[County of Origin],I9,Table2[College],B13,Table2[Sex],J10)","v":0},{"$f":"COUNTIFS(Table2[Year],E6,Table2[Semester],E7,Table2[County of Origin],K9,Table2[College],B13,Table2[Sex],K10)","v":0},{"$f":"COUNTIFS(Table2[Year],E6,Table2[Semester],E7,Table2[County of Origin],K9,Table2[College],B13,Table2[Sex],L10)","v":0},{"$f":"COUNTIFS(Table2[Year],E6,Table2[Semester],E7,Table2[County of Origin],M9,Table2[College],B13,Table2[Sex],M10)","v":1},{"$f":"COUNTIFS(Table2[Year],E6,Table2[Semester],E7,Table2[County of Origin],M9,Table2[College],B13,Table2[Sex],N10)","v":0},{"$f":"COUNTIFS(Table2[Year],E6,Table2[Semester],E7,Table2[County of Origin],O9,Table2[College],B13,Table2[Sex],O10)","v":7},{"$f":"COUNTIFS(Table2[Year],E6,Table2[Semester],E7,Table2[County of Origin],O9,Table2[College],B13,Table2[Sex],P10)","v":4},{"$f":"COUNTIFS(Table2[Year],E6,Table2[Semester],E7,Table2[County of Origin],Q9,Table2[College],B13,Table2[Sex],Q10)","v":0},{"$f":"COUNTIFS(Table2[Year],E6,Table2[Semester],E7,Table2[County of Origin],Q9,Table2[College],B13,Table2[Sex],R10)","v":1}]
[null,"College of Technology",{"$f":"COUNTIFS(Table2[Year],E6,Table2[Semester],E7,Table2[County of Origin],C9,Table2[College],B14,Table2[Sex],C10)","v":1},{"$f":"COUNTIFS(Table2[Year],E6,Table2[Semester],E7,Table2[County of Origin],C9,Table2[College],B14,Table2[Sex],D10)","v":0},{"$f":"COUNTIFS(Table2[Year],E6,Table2[Semester],E7,Table2[County of Origin],E9,Table2[College],B14,Table2[Sex],E10)","v":4},{"$f":"COUNTIFS(Table2[Year],E6,Table2[Semester],E7,Table2[County of Origin],E9,Table2[College],B14,Table2[Sex],F10)","v":0},{"$f":"COUNTIFS(Table2[Year],E6,Table2[Semester],E7,Table2[County of Origin],G9,Table2[College],B14,Table2[Sex],G10)","v":0},{"$f":"COUNTIFS(Table2[Year],E6,Table2[Semester],E7,Table2[County of Origin],G9,Table2[College],B14,Table2[Sex],H10)","v":0},{"$f":"COUNTIFS(Table2[Year],E6,Table2[Semester],E7,Table2[County of Origin],I9,Table2[College],B14,Table2[Sex],I10)","v":3},{"$f":"COUNTIFS(Table2[Year],E6,Table2[Semester],E7,Table2[County of Origin],I9,Table2[College],B14,Table2[Sex],J10)","v":0},{"$f":"COUNTIFS(Table2[Year],E6,Table2[Semester],E7,Table2[County of Origin],K9,Table2[College],B14,Table2[Sex],K10)","v":3},{"$f":"COUNTIFS(Table2[Year],E6,Table2[Semester],E7,Table2[County of Origin],K9,Table2[College],B14,Table2[Sex],L10)","v":0},{"$f":"COUNTIFS(Table2[Year],E6,Table2[Semester],E7,Table2[County of Origin],M9,Table2[College],B14,Table2[Sex],M10)","v":2},{"$f":"COUNTIFS(Table2[Year],E6,Table2[Semester],E7,Table2[County of Origin],M9,Table2[College],B14,Table2[Sex],N10)","v":0},{"$f":"COUNTIFS(Table2[Year],E6,Table2[Semester],E7,Table2[County of Origin],O9,Table2[College],B14,Table2[Sex],O10)","v":14},{"$f":"COUNTIFS(Table2[Year],E6,Table2[Semester],E7,Table2[County of Origin],O9,Table2[College],B14,Table2[Sex],P10)","v":3},{"$f":"COUNTIFS(Table2[Year],E6,Table2[Semester],E7,Table2[County of Origin],Q9,Table2[College],B14,Table2[Sex],Q10)","v":6},{"$f":"COUNTIFS(Table2[Year],E6,Table2[Semester],E7,Table2[County of Origin],Q9,Table2[College],B14,Table2[Sex],R10)","v":0}]
[null,"College of Education",{"$f":"COUNTIFS(Table2[Year],E6,Table2[Semester],E7,Table2[County of Origin],C9,Table2[College],B15,Table2[Sex],C10)","v":0},{"$f":"COUNTIFS(Table2[Year],E6,Table2[Semester],E7,Table2[County of Origin],C9,Table2[College],B15,Table2[Sex],D10)","v":0},{"$f":"COUNTIFS(Table2[Year],E6,Table2[Semester],E7,Table2[County of Origin],E9,Table2[College],B15,Table2[Sex],E10)","v":0},{"$f":"COUNTIFS(Table2[Year],E6,Table2[Semester],E7,Table2[County of Origin],E9,Table2[College],B15,Table2[Sex],F10)","v":0},{"$f":"COUNTIFS(Table2[Year],E6,Table2[Semester],E7,Table2[County of Origin],G9,Table2[College],B15,Table2[Sex],G10)","v":0},{"$f":"COUNTIFS(Table2[Year],E6,Table2[Semester],E7,Table2[County of Origin],G9,Table2[College],B15,Table2[Sex],H10)","v":0},{"$f":"COUNTIFS(Table2[Year],E6,Table2[Semester],E7,Table2[County of Origin],I9,Table2[College],B15,Table2[Sex],I10)","v":1},{"$f":"COUNTIFS(Table2[Year],E6,Table2[Semester],E7,Table2[County of Origin],I9,Table2[College],B15,Table2[Sex],J10)","v":0},{"$f":"COUNTIFS(Table2[Year],E6,Table2[Semester],E7,Table2[County of Origin],K9,Table2[College],B15,Table2[Sex],K10)","v":1},{"$f":"COUNTIFS(Table2[Year],E6,Table2[Semester],E7,Table2[County of Origin],K9,Table2[College],B15,Table2[Sex],L10)","v":0},{"$f":"COUNTIFS(Table2[Year],E6,Table2[Semester],E7,Table2[County of Origin],M9,Table2[College],B15,Table2[Sex],M10)","v":1},{"$f":"COUNTIFS(Table2[Year],E6,Table2[Semester],E7,Table2[County of Origin],M9,Table2[College],B15,Table2[Sex],N10)","v":0},{"$f":"COUNTIFS(Table2[Year],E6,Table2[Semester],E7,Table2[County of Origin],O9,Table2[College],B15,Table2[Sex],O10)","v":21},{"$f":"COUNTIFS(Table2[Year],E6,Table2[Semester],E7,Table2[County of Origin],O9,Table2[College],B15,Table2[Sex],P10)","v":3},{"$f":"COUNTIFS(Table2[Year],E6,Table2[Semester],E7,Table2[County of Origin],Q9,Table2[College],B15,Table2[Sex],Q10)","v":1},{"$f":"COUNTIFS(Table2[Year],E6,Table2[Semester],E7,Table2[County of Origin],Q9,Table2[College],B15,Table2[Sex],R10)","v":0}]
[]
[null,"Total",{"$f":"SUM(C11:C15)","v":3},0,4,1,1,0,7,2,4,1,8,0,54,13,11,3]
[]
[null,"Percentage",{"$f":"C17/SUM(C17:D17)","v":1},{"$f":"D17/SUM(C17:D17)","v":0},{"$f":"E17/SUM(E17:F17)","v":0.8},{"$f":"F17/SUM(E17:F17)","v":0.2},{"$f":"G17/SUM(G17:H17)","v":1},{"$f":"H17/SUM(G17:H17)","v":0},{"$f":"I17/SUM(I17:J17)","v":0.77777777777777779},{"$f":"J17/SUM(I17:J17)","v":0.22222222222222221},{"$f":"K17/SUM(K17:L17)","v":0.8},{"$f":"L17/SUM(K17:L17)","v":0.2},{"$f":"M17/SUM(M17:N17)","v":1},{"$f":"N17/SUM(M17:N17)","v":0},{"$f":"O17/SUM(O17:P17)","v":0.80597014925373134},{"$f":"P17/SUM(O17:P17)","v":0.19402985074626866},{"$f":"Q17/SUM(Q17:R17)","v":0.7857142857142857},{"$f":"R17/SUM(Q17:R17)","v":0.21428571428571427}]
[]
{"$rows_left_out":26}
{"sheet":"Graph","index":4,"n_rows":19,"n_cols":4,"rows_kept":19,"cut":false,"hidden":false,"merged":[]}
[]
[]
[null,null,"Bomi",{"$f":"'General Statistics'!C21:D21","v":0}]
[null,null,"Bong",{"$f":"'General Statistics'!E21:E21","v":7.5075075075075074E-3}]
[null,null,"Gbarpolu",{"$f":"'General Statistics'!G21:G21","v":1.5015015015015015E-3}]
[null,null,"Grand Bassa",{"$f":"'General Statistics'!I21:I21","v":1.3513513513513514E-2}]
[null,null,"Grand Cape Mount",{"$f":"'General Statistics'!K21:K21","v":7.5075075075075074E-3}]
[null,null,"Grand Gedeh",{"$f":"'General Statistics'!M21:M21","v":1.2012012012012012E-2}]
[null,null,"Grand Kru",{"$f":"'General Statistics'!O21:O21","v":0.1006006006006006}]
[null,null,"Lofa",{"$f":"'General Statistics'!Q21:Q21","v":2.1021021021021023E-2}]
[null,null,"Margibi",{"$f":"'General Statistics'!C35:D35","v":0}]
[null,null,"Montserrado",{"$f":"'General Statistics'!E35:E35","v":6.006006006006006E-3}]
[null,null,"Nimba",{"$f":"'General Statistics'!G35:G35","v":9.0090090090090089E-3}]
[null,null,"River Cess",{"$f":"'General Statistics'!I35:I35","v":1.5015015015015015E-3}]
[null,null,"River Gee",{"$f":"'General Statistics'!K35:K35","v":4.8048048048048048E-2}]
[null,null,"Sinoe",{"$f":"'General Statistics'!M35:M35","v":1.5015015015015015E-2}]
[null,null,"Maryland",{"$f":"'General Statistics'!O35:O35","v":0.35885885885885888}]
[null,null,"Non-Liberian",{"$f":"'General Statistics'!Q35:Q35","v":3.003003003003003E-3}]
[null,null,null,{"$f":"SUM(D3:D18)","v":0.60510510510510518}]